Target
Carboxypeptidase B2
Ligand
BDBM81903
Substrate
Meas. Tech.
Inhibition Assay
Ki
1.45e+5±n/a nM
Citation
 Fernández, DAvilés, FXVendrell, J Aromatic organic compounds as scaffolds for metallocarboxypeptidase inhibitor design. Chem Biol Drug Des 73:75-82 (2009)  
Target
Name:
Carboxypeptidase B2
Synonyms:
CBPB2_HUMAN CPU Carboxypeptidase B2 isoform A Plasma carboxypeptidase B Thrombin-activable fibrinolysis inhibitor | pCPB
Type:
Enzyme
Mol. Mass.:
48432.74
Organism:
Homo sapiens (Human)
Description:
Q96IY4
Residue:
423
  
Inhibitor
Name:
BDBM81903
Synonyms:
2-amino-3-(1-aminoisoquinolin-7-yl)propanoic acid, 2
Type:
Small organic molecule
Emp. Form.:
C12H13N3O2
Mol. Mass.:
231.2505
SMILES:
NC(Cc1ccc2ccnc(N)c2c1)C(O)=O
: