Target
Carboxypeptidase B2
Ligand
BDBM81906
Substrate
Meas. Tech.
Inhibition Assay
Ki
1.9e+3±n/a nM
Citation
 Fernández, DAvilés, FXVendrell, J Aromatic organic compounds as scaffolds for metallocarboxypeptidase inhibitor design. Chem Biol Drug Des 73:75-82 (2009)  
Target
Name:
Carboxypeptidase B2
Synonyms:
CBPB2_HUMAN CPU Carboxypeptidase B2 isoform A Plasma carboxypeptidase B Thrombin-activable fibrinolysis inhibitor | pCPB
Type:
Enzyme
Mol. Mass.:
48432.74
Organism:
Homo sapiens (Human)
Description:
Q96IY4
Residue:
423
  
Inhibitor
Name:
BDBM81906
Synonyms:
2-(5-(naphthalen-2-yloxy)methyl)-1,3,4-oxadiazol-2-ylthio)-1-p-tolylethanone, 5
Type:
Small organic molecule
Emp. Form.:
C22H18N2O3S
Mol. Mass.:
390.455
SMILES:
Cc1ccc(cc1)C(=O)CSc1nnc(COc2ccc3ccccc3c2)o1
: