Target
Adenosine receptor A3
Ligand
BDBM21173
Substrate
Ki
0.1±n/a nM
Comments
PDSP_739
Citation
 Klotz, KNVogt, HTawfik-Schlieper, H Comparison of A1 adenosine receptors in brain from different species by radioligand binding and photoaffinity labelling. Naunyn Schmiedebergs Arch Pharmacol 343:196-201 (1991)  
Target
Name:
Adenosine receptor A3
Synonyms:
AA3R_SHEEP ADENOSINE A1 high ADENOSINE A3 ADORA3
Type:
Enzyme Catalytic Domain
Mol. Mass.:
36152.74
Organism:
Sheep
Description:
ADENOSINE A1 ADORA1 Sheep::P35342
Residue:
317
  
Inhibitor
Name:
BDBM21173
Synonyms:
1,3-dipropyl-8-cyclopentylxanthine CHEMBL183 PD116948 | [3H]DPCPX
Type:
radiolabeled ligand
Emp. Form.:
C16H24N4O2
Mol. Mass.:
304.3874
SMILES:
CCCn1c2nc([nH]c2c(=O)n(CCC)c1=O)C1CCCC1
: