Target
D(1A) dopamine receptor
Ligand
BDBM50026957
Substrate
Ki
721±n/a nM
Comments
PDSP_358
Citation
 Simonneaux, VMurrin, LCEbadi, M Characterization of D1 dopamine receptors in the bovine pineal gland with [3H]SCH 23390. J Pharmacol Exp Ther 253:214-20 (1990) Target
Name:
D(1A) dopamine receptor
Synonyms:
D(1A) dopamine receptor DOPAMINE D1 DRD1_BOVIN | Dopamine receptor
Type:
Enzyme Catalytic Domain
Mol. Mass.:
49330.65
Organism:
BOVINE
Description:
DOPAMINE D1 DRD1 BOVINE::Q95136
Residue:
446
  
Inhibitor
Name:
BDBM50026957
Synonyms:
(cis) 2-{4-[3-(2-Trifluoromethyl-thioxanthen-9-ylidene)-propyl]-piperazin-1-yl}-ethanol(Flupentixol) 2-(4-{3-[2-Trifluoromethyl-thioxanthen-(9E)-ylidene]-propyl}-piperazin-1-yl)-ethanol FLUPENTHIXOL, Alpha Flupenthixol | Flupenthixol, Beta
Type:
Small organic molecule
Emp. Form.:
C23H25F3N2OS
Mol. Mass.:
434.518
SMILES:
OCCN1CCN(CC\C=C2/c3ccccc3Sc3ccc(cc23)C(F)(F)F)CC1
: