Target
Muscarinic acetylcholine receptor M4
Ligand
BDBM50018056
Substrate
Ki
1600±n/a nM
Comments
PDSP_246
Citation
 Waelbroeck, MTastenoy, MCamus, JChristophe, J Binding of selective antagonists to four muscarinic receptors (M1 to M4) in rat forebrain. Mol Pharmacol 38:267-73 (1990) Target
Name:
Muscarinic acetylcholine receptor M4
Synonyms:
ACM4_MOUSE Chrm-4 Mm4 mAChR | Muscarinic acetylcholine receptor
Type:
Enzyme Catalytic Domain
Mol. Mass.:
53004.88
Organism:
MOUSE
Description:
Cholinergic, muscarinic M4 CHRM4 MOUSE::P32211
Residue:
479
  
Inhibitor
Name:
BDBM50018056
Synonyms:
(AF-DX 116) 11-[2-(2-Diethylaminomethyl-piperidin-1-yl)-acetyl]-5,11-dihydro-benzo[e]pyrido[3,2-b][1,4]diazepin-6-one 2-Diethylaminomethyl-1-[2-oxo-2-(6-oxo-5,6-dihydro-benzo[e]pyrido[3,2-b][1,4]diazepin-11-yl)-ethyl]-piperidinium AF-DX 116 CHEMBL17045 | Otenzepad
Type:
Small organic molecule
Emp. Form.:
C24H31N5O2
Mol. Mass.:
421.5352
SMILES:
CCN(CC)CC1CCCCN1CC(=O)N1c2ccccc2C(=O)Nc2cccnc12
: