Target
Muscarinic acetylcholine receptor M4
Ligand
BDBM50071173
Substrate
Ki
60±n/a nM
Comments
PDSP_933
Citation
 Waelbroeck, MTastenoy, MCamus, JChristophe, J Binding of selective antagonists to four muscarinic receptors (M1 to M4) in rat forebrain. Mol Pharmacol 38:267-73 (1990) Target
Name:
Muscarinic acetylcholine receptor M4
Synonyms:
ACM4_MOUSE Chrm-4 Mm4 mAChR | Muscarinic acetylcholine receptor
Type:
Enzyme Catalytic Domain
Mol. Mass.:
53004.88
Organism:
MOUSE
Description:
Cholinergic, muscarinic M4 CHRM4 MOUSE::P32211
Residue:
479
  
Inhibitor
Name:
BDBM50071173
Synonyms:
(3R,4R,4aS,8aR)-4-[(E)-2-((2S,6S)-1,6-Dimethyl-piperidin-2-yl)-vinyl]-3-methyl-decahydro-naphtho[2,3-c]furan-1-one HIMBACINE
Type:
Small organic molecule
Emp. Form.:
C22H35NO2
Mol. Mass.:
345.5188
SMILES:
C[C@H]1OC(=O)C2C[C@H]3CCCC[C@@H]3[C@@H](\C=C\[C@@H]3CCC[C@H](C)N3C)C12
: