Target
D(1A) dopamine receptor
Ligand
BDBM55121
Substrate
Ki
380±n/a nM
Comments
PDSP_728
Citation
 Andersen, PHGrønvald, FCJansen, JA A comparison between dopamine-stimulated adenylate cyclase and 3H-SCH 23390 binding in rat striatum. Life Sci 37:1971-83 (1985)  
Target
Name:
D(1A) dopamine receptor
Synonyms:
DOPAMINE D1 Dopamine D1 high Dopamine receptor Dopamine1-like Drd1a
Type:
Enzyme Catalytic Domain
Mol. Mass.:
49429.75
Organism:
RAT
Description:
P18901
Residue:
446
  
Inhibitor
Name:
BDBM55121
Synonyms:
3-HYDROXYTYRAMINE HYDROCHLORIDE 4-(2-aminoethyl)pyrocatechol;hydrochloride Dopamine SMR000059081 | cid_65340
Type:
Small organic molecule
Emp. Form.:
C8H11NO2
Mol. Mass.:
153.1784
SMILES:
NCCc1ccc(O)c(O)c1
: