Target
ATP synthase subunit a
Ligand
BDBM81944
Substrate
Ki
4.7±n/a nM
Comments
PDSP_1306
Citation
 Burcher, EBuck, SHLovenberg, WO'Donohue, TL Characterization and autoradiographic localization of multiple tachykinin binding sites in gastrointestinal tract and bladder. J Pharmacol Exp Ther 236:819-31 (1986) Target
Name:
ATP synthase subunit a
Synonyms:
ATP synthase subunit a Atp6 BHE Mtatp6
Type:
Enzyme Catalytic Domain
Mol. Mass.:
25083.82
Organism:
RAT
Description:
P05504
Residue:
226
  
Inhibitor
Name:
BDBM81944
Synonyms:
CAS_86933-75-7 NSC_5311312 | neuromedin K
Type:
Small organic molecule
Emp. Form.:
C55H79N13O14S2
Mol. Mass.:
1210.424
SMILES:
CSCCC(NC(=O)C(CC(C)C)NC(=O)CNC(=O)C(NC(=O)C(Cc1ccccc1)NC(=O)C(Cc1ccccc1)NC(=O)C(CC(O)=O)NC(=O)C(Cc1cnc[nH]1)NC(=O)C(CCSC)NC(=O)C(N)CC(O)=O)C(C)C)C(N)=O
: