Target
Eledoisin
Ligand
BDBM81942
Substrate
Ki
10±n/a nM
Comments
PDSP_1774
Citation
 Burcher, EBuck, SHLovenberg, WO'Donohue, TL Characterization and autoradiographic localization of multiple tachykinin binding sites in gastrointestinal tract and bladder. J Pharmacol Exp Ther 236:819-31 (1986) Target
Name:
Eledoisin
Synonyms:
BHE
Type:
Enzyme Catalytic Domain
Mol. Mass.:
1206.41
Organism:
Eledone moschata (Musky octopus) (Ozaena moschata)
Description:
BHE 0 GUINEA PIG::P62934
Residue:
11
QPSKDAFIGLM
  
Inhibitor
Name:
BDBM81942
Synonyms:
CAS_55582 NSC_55582 Substance K
Type:
Small organic molecule
Emp. Form.:
C50H80N14O14S
Mol. Mass.:
1133.321
SMILES:
CSCCC(NC(=O)C(CC(C)C)NC(=O)CNC(=O)C(NC(=O)C(Cc1ccccc1)NC(=O)C(CO)NC(=O)C(CC(O)=O)NC(=O)C(NC(=O)C(CCCCN)NC(=O)C(N)Cc1cnc[nH]1)C(C)O)C(C)C)C(N)=O
: