Target
5-hydroxytryptamine receptor 2A
Ligand
BDBM81950
Substrate
Ki
1788±n/a nM
Comments
PDSP_3871
Citation
 Sánchez-Roa, PMGrigoriadis, DEWilson, AASharkey, JDannals, RFVillemagne, VLWong, DFWagner, HNKuhar, MJ [125]I-spectramide: a novel benzamide displaying potent and selective effects at the D2 dopamine receptor. Life Sci 45:1821-9 (1989)  
Target
Name:
5-hydroxytryptamine receptor 2A
Synonyms:
5-HT-2A 5-HT2A 5-hydroxytryptamine receptor 2A (5HT2A) Htr2 Serotonin Receptor 2A
Type:
G Protein-Coupled Receptor (GPCR)
Mol. Mass.:
52852.05
Organism:
Rattus norvegicus (rat)
Description:
Rat cortex membranes 5-HT2A receptors.
Residue:
471
  
Inhibitor
Name:
BDBM81950
Synonyms:
CAS_130377 Spectramide
Type:
Small organic molecule
Emp. Form.:
C19H23ClIN3O2
Mol. Mass.:
487.762
SMILES:
CNc1cc(OC)c(cc1Cl)C(=O)NCCN(C)Cc1ccc(I)cc1
: