Target
Norepinephrine transporter
Ligand
BDBM81950
Substrate
Ki
2715±n/a nM
Comments
PDSP_3871
Citation
 Sánchez-Roa, PMGrigoriadis, DEWilson, AASharkey, JDannals, RFVillemagne, VLWong, DFWagner, HNKuhar, MJ [125]I-spectramide: a novel benzamide displaying potent and selective effects at the D2 dopamine receptor. Life Sci 45:1821-9 (1989)  
Target
Name:
Norepinephrine transporter
Synonyms:
Type:
Enzyme Catalytic Domain
Mol. Mass.:
2082.45
Organism:
RAT
Description:
Norepinephrine transporter 0 RAT::Q9JIA2
Residue:
19
MLLARMKPQVQPELGGADQ
  
Inhibitor
Name:
BDBM81950
Synonyms:
CAS_130377 Spectramide
Type:
Small organic molecule
Emp. Form.:
C19H23ClIN3O2
Mol. Mass.:
487.762
SMILES:
CNc1cc(OC)c(cc1Cl)C(=O)NCCN(C)Cc1ccc(I)cc1
: