Target
Muscarinic acetylcholine receptor M2
Ligand
BDBM50064176
Substrate
Ki
16.7±n/a nM
Comments
PDSP_1220
Citation
 McKinney, MAnderson, DForray, Cel-Fakahany, EE Characterization of the striatal M2 muscarinic receptor mediating inhibition of cyclic AMP using selective antagonists: a comparison with the brainstem M2 receptor. J Pharmacol Exp Ther 250:565-72 (1989) Target
Name:
Muscarinic acetylcholine receptor M2
Synonyms:
ACM2_RAT Chrm-2 | Chrm2
Type:
Enzyme Catalytic Domain
Mol. Mass.:
51555.53
Organism:
RAT
Description:
P10980
Residue:
466
  
Inhibitor
Name:
BDBM50064176
Synonyms:
CHEMBL27673 METHOCTRAMINE N1,N8-bis(6-(2-methoxybenzylamino)hexyl)octane-1,8-diamine
Type:
Small organic molecule
Emp. Form.:
C36H62N4O2
Mol. Mass.:
582.9031
SMILES:
COc1ccccc1CNCCCCCCNCCCCCCCCNCCCCCCNCc1ccccc1OC
: