Target
Muscarinic acetylcholine receptor M2
Ligand
BDBM81959
Substrate
Ki
23±n/a nM
Comments
PDSP_940
Citation
 Buckley, NJBonner, TIBuckley, CMBrann, MR Antagonist binding properties of five cloned muscarinic receptors expressed in CHO-K1 cells. Mol Pharmacol 35:469-76 (1989) Target
Name:
Muscarinic acetylcholine receptor M2
Synonyms:
ACM2_HUMAN Cholinergic, muscarinic M2 Muscarinic acetylcholine receptor M2 and M5 | RecName: Full=Muscarinic acetylcholine receptor M2
Type:
GPCR
Mol. Mass.:
51730.61
Organism:
Homo sapiens (Human)
Description:
P08172
Residue:
466
  
Inhibitor
Name:
BDBM81959
Synonyms:
CAS_115-63-9 | Hexocyclium
Type:
Small organic molecule
Emp. Form.:
C20H33N2O
Mol. Mass.:
317.4883
SMILES:
C[N+]1(C)CCN(CC(O)(C2CCCCC2)c2ccccc2)CC1
: