Target
Glutamate receptor ionotropic, NMDA 1
Ligand
BDBM18125
Substrate
Ki
1400±n/a nM
Comments
PDSP_1058
Citation
 Murphy, DEHutchison, AJHurt, SDWilliams, MSills, MA Characterization of the binding of [3H]-CGS 19755: a novel N-methyl-D-aspartate antagonist with nanomolar affinity in rat brain. Br J Pharmacol 95:932-8 (1988)  
Target
Name:
Glutamate receptor ionotropic, NMDA 1
Synonyms:
Glutamate (NMDA) receptor subunit zeta 1 Glutamate-NMDA-Channel Glutamate-NMDA-Polyamine NMDA Nmdar1 | phencyclidine
Type:
Enzyme Catalytic Domain
Mol. Mass.:
105533.40
Organism:
RAT
Description:
P35439
Residue:
938
  
Inhibitor
Name:
BDBM18125
Synonyms:
(2S)-2-aminobutanedioic acid CHEMBL274323 L-Aspartic acid, 2 | L-[14C]aspartate
Type:
Amino Acid
Emp. Form.:
C4H7NO4
Mol. Mass.:
133.1027
SMILES:
N[C@@H](CC(O)=O)C(O)=O
: