Target
Interleukin-1 receptor-associated kinase 1
Ligand
BDBM271358
Substrate
Meas. Tech.
IRAK1 Enzymatic Assay
pH
7±n/a
IC50
<100±n/a nM
Comments
extracted
Citation
 Jorand-Lebrun, CKulkarni, SChristmann-Franck, S Macrocyclic pyridazinone derivatives US Patent  US10064861 Publication Date 9/4/2018 
Target
Name:
Interleukin-1 receptor-associated kinase 1
Synonyms:
IRAK IRAK1 Interleukin-1 receptor-associated kinase 1 (IRAK-1)
Type:
Enzyme
Mol. Mass.:
76536.81
Organism:
Homo sapiens (Human)
Description:
P51617
Residue:
712
  
Inhibitor
Name:
BDBM271358
Synonyms:
US10064861, Compound 13
Type:
Small organic molecule
Emp. Form.:
C26H18ClN5O2
Mol. Mass.:
467.906
SMILES:
Clc1ccc2Cn3c(NC(=O)c4cccc(Cn5nc(ccc5=O)-c1c2)c4)nc1ccccc31
: