Target
Interleukin-1 receptor-associated kinase 1
Ligand
BDBM271366
Substrate
Meas. Tech.
IRAK1 Enzymatic Assay
pH
7±n/a
IC50
<100±n/a nM
Comments
extracted
Citation
 Jorand-Lebrun, CKulkarni, SChristmann-Franck, S Macrocyclic pyridazinone derivatives US Patent  US10064861 Publication Date 9/4/2018 
Target
Name:
Interleukin-1 receptor-associated kinase 1
Synonyms:
IRAK IRAK1 Interleukin-1 receptor-associated kinase 1 (IRAK-1)
Type:
Enzyme
Mol. Mass.:
76536.81
Organism:
Homo sapiens (Human)
Description:
P51617
Residue:
712
  
Inhibitor
Name:
BDBM271366
Synonyms:
US10064861, Compound 21
Type:
Small organic molecule
Emp. Form.:
C27H19N5O4
Mol. Mass.:
477.4709
SMILES:
OC(=O)c1ccc2n3Cc4cccc(c4)-c4ccc(=O)n(Cc5cccc(c5)C(=O)Nc3nc2c1)n4
: