Target
Interleukin-1 receptor-associated kinase 1
Ligand
BDBM271371
Substrate
Meas. Tech.
IRAK1 Enzymatic Assay
pH
7±n/a
IC50
<100±n/a nM
Comments
extracted
Citation
 Jorand-Lebrun, CKulkarni, SChristmann-Franck, S Macrocyclic pyridazinone derivatives US Patent  US10064861 Publication Date 9/4/2018 
Target
Name:
Interleukin-1 receptor-associated kinase 1
Synonyms:
IRAK IRAK1 Interleukin-1 receptor-associated kinase 1 (IRAK-1)
Type:
Enzyme
Mol. Mass.:
76536.81
Organism:
Homo sapiens (Human)
Description:
P51617
Residue:
712
  
Inhibitor
Name:
BDBM271371
Synonyms:
US10064861, Compound 26
Type:
Small organic molecule
Emp. Form.:
C25H21N7O2
Mol. Mass.:
451.4799
SMILES:
Cc1cc(=O)n2Cc3cccc(c3)C(=O)Nc3nc4ccccc4n3CCn3cc(cn3)-c1n2
: