Target
Interleukin-1 receptor-associated kinase 1
Ligand
BDBM271379
Substrate
Meas. Tech.
IRAK1 Enzymatic Assay
pH
7±n/a
IC50
<100±n/a nM
Comments
extracted
Citation
 Jorand-Lebrun, CKulkarni, SChristmann-Franck, S Macrocyclic pyridazinone derivatives US Patent  US10064861 Publication Date 9/4/2018 
Target
Name:
Interleukin-1 receptor-associated kinase 1
Synonyms:
IRAK IRAK1 Interleukin-1 receptor-associated kinase 1 (IRAK-1)
Type:
Enzyme
Mol. Mass.:
76536.81
Organism:
Homo sapiens (Human)
Description:
P51617
Residue:
712
  
Inhibitor
Name:
BDBM271379
Synonyms:
US10064861, Compound 33
Type:
Small organic molecule
Emp. Form.:
C25H21N7O3
Mol. Mass.:
467.4793
SMILES:
COc1ccc2n3CCn4cc(cn4)-c4ccc(=O)n(Cc5cccc(c5)C(=O)Nc3nc2c1)n4
: