Target
Interleukin-1 receptor-associated kinase 1
Ligand
BDBM271382
Substrate
Meas. Tech.
IRAK1 Enzymatic Assay
pH
7±n/a
IC50
<100±n/a nM
Comments
extracted
Citation
 Jorand-Lebrun, CKulkarni, SChristmann-Franck, S Macrocyclic pyridazinone derivatives US Patent  US10064861 Publication Date 9/4/2018 
Target
Name:
Interleukin-1 receptor-associated kinase 1
Synonyms:
IRAK IRAK1 Interleukin-1 receptor-associated kinase 1 (IRAK-1)
Type:
Enzyme
Mol. Mass.:
76536.81
Organism:
Homo sapiens (Human)
Description:
P51617
Residue:
712
  
Inhibitor
Name:
BDBM271382
Synonyms:
US10064861, Compound 36a
Type:
Small organic molecule
Emp. Form.:
C28H23N5O2
Mol. Mass.:
461.5145
SMILES:
CC[C@H]1c2cccc(c2)C(=O)Nc2nc3ccccc3n2Cc2cccc(c2)-c2ccc(=O)n1n2
: