Target
Interleukin-1 receptor-associated kinase 1
Ligand
BDBM271384
Substrate
Meas. Tech.
IRAK1 Enzymatic Assay
pH
7±n/a
IC50
<100±n/a nM
Comments
extracted
Citation
 Jorand-Lebrun, CKulkarni, SChristmann-Franck, S Macrocyclic pyridazinone derivatives US Patent  US10064861 Publication Date 9/4/2018 
Target
Name:
Interleukin-1 receptor-associated kinase 1
Synonyms:
IRAK IRAK1 Interleukin-1 receptor-associated kinase 1 (IRAK-1)
Type:
Enzyme
Mol. Mass.:
76536.81
Organism:
Homo sapiens (Human)
Description:
P51617
Residue:
712
  
Inhibitor
Name:
BDBM271384
Synonyms:
US10064861, Compound 37
Type:
Small organic molecule
Emp. Form.:
C28H23N5O3
Mol. Mass.:
477.5139
SMILES:
COc1ccc-2cc1CCn1c(NC(=O)c3cccc(Cn4nc-2ccc4=O)c3)nc2ccccc12
: