Target
Alpha-2B adrenergic receptor
Ligand
BDBM81444
Substrate
Ki
0.27±n/a nM
Comments
PDSP_1955
Citation
 Murphy, TJBylund, DB Characterization of alpha-2 adrenergic receptors in the OK cell, an opossum kidney cell line. J Pharmacol Exp Ther 244:571-8 (1988) Target
Name:
Alpha-2B adrenergic receptor
Synonyms:
ADA2B_DIDVI Alpha-2B adrenergic receptor | adrenergic Alpha2
Type:
Enzyme Catalytic Domain
Mol. Mass.:
41875.91
Organism:
OPOSSUM
Description:
adrenergic Alpha2 0 OPOSSUM::O77715
Residue:
382
  
Inhibitor
Name:
BDBM81444
Synonyms:
CAS_185453 WB 4101 | WB-4101
Type:
Small organic molecule
Emp. Form.:
C25H27NO5
Mol. Mass.:
421.4856
SMILES:
COc1cccc(OC)c1OCCNCC1Oc2ccccc2OC1c1ccccc1
: