Target
D(1A) dopamine receptor
Ligand
BDBM81775
Substrate
Ki
>10000±n/a nM
Comments
PDSP_3962
Citation
 Andersen, PH Comparison of the pharmacological characteristics of [3H]raclopride and [3H]SCH 23390 binding to dopamine receptors in vivo in mouse brain. Eur J Pharmacol 146:113-20 (1988)  
Target
Name:
D(1A) dopamine receptor
Synonyms:
D(1A) dopamine receptor DRD1_MOUSE Dopamine receptor Drd1a | Gpcr15
Type:
Enzyme
Mol. Mass.:
49613.93
Organism:
Mus musculus (Mouse)
Description:
Q61616
Residue:
446
  
Inhibitor
Name:
BDBM81775
Synonyms:
Sulpiride-R Sulpiride-high,(-) | Sulpiride-low,(-)
Type:
Emp. Form.:
C15H23N3O4S
Mol. Mass.:
341.426
SMILES:
CCN1CCC[C@@H]1CNC(=O)c1cc(ccc1OC)S(N)(=O)=O
: