Target
D(2) dopamine receptor
Ligand
BDBM50004822
Substrate
Ki
9300±n/a nM
Comments
PDSP_1719
Citation
 Andersen, PH Comparison of the pharmacological characteristics of [3H]raclopride and [3H]SCH 23390 binding to dopamine receptors in vivo in mouse brain. Eur J Pharmacol 146:113-20 (1988)  
Target
Name:
D(2) dopamine receptor
Synonyms:
DOPAMINE D2 Dopamine D2 receptor Drd2
Type:
Enzyme
Mol. Mass.:
50957.64
Organism:
Mus musculus (Mouse)
Description:
P61168
Residue:
444
  
Inhibitor
Name:
BDBM50004822
Synonyms:
(R)-1-phenyl-2,3,4,5-tetrahydro-1H-benzo[d]azepine-7,8-diol 1-Phenyl-2,3,4,5-tetrahydro-1H-benzo[d]azepine-7,8-diol 7,8-Dihydroxy-1-phenyl-2,3,4,5-tetrahydro-1H-benzo[d]azepinium(R(+)SKF38393) CHEMBL24077 SK&F-383933 SK-383933 SKF 38393 (+)
Type:
Small organic molecule
Emp. Form.:
C16H17NO2
Mol. Mass.:
255.3117
SMILES:
Oc1cc2CCNC[C@H](c3ccccc3)c2cc1O
: