Target
Muscarinic acetylcholine receptor M2
Ligand
BDBM86231
Substrate
Ki
2.38±n/a nM
Comments
PDSP_334
Citation
 Richelson, E Neuroleptic binding to human brain receptors: relation to clinical effects. Ann N Y Acad Sci 537:435-42 (1988)  
Target
Name:
Muscarinic acetylcholine receptor M2
Synonyms:
ACM2_HUMAN Cholinergic, muscarinic M2 Muscarinic acetylcholine receptor M2 and M5 | RecName: Full=Muscarinic acetylcholine receptor M2
Type:
GPCR
Mol. Mass.:
51730.61
Organism:
Homo sapiens (Human)
Description:
P08172
Residue:
466
  
Inhibitor
Name:
BDBM86231
Synonyms:
ATR Atropine,(-) CHEMBL195 US9333195, ATROPINE
Type:
Small organic molecule
Emp. Form.:
C17H23NO3
Mol. Mass.:
289.3694
SMILES:
CN1C2CCC1CC(C2)OC(=O)C(CO)c1ccccc1
: