Target
Norepinephrine transporter
Ligand
BDBM50073444
Substrate
Ki
3800±n/a nM
Comments
PDSP_1905
Citation
 Shank, RPVaught, JLPelley, KASetler, PEMcComsey, DFMaryanoff, BE McN-5652: a highly potent inhibitor of serotonin uptake. J Pharmacol Exp Ther 247:1032-8 (1988) Target
Name:
Norepinephrine transporter
Synonyms:
Type:
Enzyme Catalytic Domain
Mol. Mass.:
2082.45
Organism:
RAT
Description:
Norepinephrine transporter 0 RAT::Q9JIA2
Residue:
19
MLLARMKPQVQPELGGADQ
  
Inhibitor
Name:
BDBM50073444
Synonyms:
2-{3-[4-(3-chlorophenyl)piperazin-1-yl]propyl}[1,2,4]triazolo[4,3-a]pyridin-3(2H)-one TRAZODONE
Type:
Small organic molecule
Emp. Form.:
C19H22ClN5O
Mol. Mass.:
371.864
SMILES:
Clc1cccc(c1)N1CCN(CCCn2nc3ccccn3c2=O)CC1
: