Target
Envelope glycoprotein gp160
Ligand
BDBM271443
Substrate
Meas. Tech.
MT4 Cell Antiviral Assay
EC50
1.000±n/a nM
Citation
 Johns, BA Compounds and compositions for treating HIV with derivatives of Betulin US Patent  US10064873 Publication Date 9/4/2018 
Target
Name:
Envelope glycoprotein gp160
Synonyms:
Env polyprotein | NL4-3
Type:
Enzyme Catalytic Domain
Mol. Mass.:
97031.14
Organism:
Human immunodeficiency virus type 1 (isolate BRU/LAI group M subtypeB) (HIV-1)
Description:
Residue:
854
  
Inhibitor
Name:
BDBM271443
Synonyms:
4- (((3aR,5aR,5bR,7aR,9S, 11aR,11bR,13aS)-3a- ((S)-2-(benzyl(2- (dimethylamino)ethyl) amino)-1-hydroxyethyl)-1- isopropyl-5a,5b,8,8,11a- pentamethyl-2-oxo- 3,3a,4,5,5a,5b,6,7,7a,8,9, 10,11,11a,11b,12,13,13a- octadecahydro-2H- cyclopenta[a]chrysen-9- yl)oxy)-2,2-dimethyl-4- oxobutanoic acid | US10064873, Example 69
Type:
Small organic molecule
Emp. Form.:
C48H74N2O6
Mol. Mass.:
775.111
SMILES:
[H][C@]12CC[C@]3([H])[C@@]4(C)CC[C@H](OC(=O)CC(C)(C)C(O)=O)C(C)(C)[C@]4([H])CC[C@@]3(C)[C@]1(C)CC[C@]1(CC(=O)C(C(C)C)=C21)[C@H](O)CN(CCN(C)C)Cc1ccccc1
: