Target
Adenosine receptor A1
Ligand
BDBM10850
Substrate
Ki
>10000±n/a nM
Comments
PDSP_2811
Citation
 Schwabe, UUkena, DLohse, MJ Xanthine derivatives as antagonists at A1 and A2 adenosine receptors. Naunyn Schmiedebergs Arch Pharmacol 330:212-21 (1985)  
Target
Name:
Adenosine receptor A1
Synonyms:
AA1R_BOVIN ADENOSINE A1 high ADORA1 | Adenosine A1 receptor
Type:
Enzyme Catalytic Domain
Mol. Mass.:
36602.99
Organism:
BOVINE
Description:
ADENOSINE 0 BOVINE::P28190
Residue:
326
  
Inhibitor
Name:
BDBM10850
Synonyms:
1-(5-Oxohexyl)theobromine (pentoxifylline) 3,7-dimethyl-1-(5-oxohexyl)-3,7-dihydropurine-2,6-dione Pentoxifylline Pentoxyphylline
Type:
Small organic molecule
Emp. Form.:
C13H18N4O3
Mol. Mass.:
278.307
SMILES:
CC(=O)CCCCn1c(=O)n(C)c2ncn(C)c2c1=O
: