Target
D(2) dopamine receptor
Ligand
BDBM55121
Substrate
Ki
211±n/a nM
Comments
PDSP_728
Citation
 Imafuku, J The characterization of [3H]sulpiride binding sites in rat striatal membranes. Brain Res 402:331-8 (1987)  
Target
Name:
D(2) dopamine receptor
Synonyms:
DOPAMINE D2 DOPAMINE D2 Short Dopamine D2 receptor Drd2
Type:
G Protein-Coupled Receptor (GPCR)
Mol. Mass.:
50931.60
Organism:
Rattus norvegicus (rat)
Description:
P61169
Residue:
444
  
Inhibitor
Name:
BDBM55121
Synonyms:
3-HYDROXYTYRAMINE HYDROCHLORIDE 4-(2-aminoethyl)pyrocatechol;hydrochloride Dopamine SMR000059081 | cid_65340
Type:
Small organic molecule
Emp. Form.:
C8H11NO2
Mol. Mass.:
153.1784
SMILES:
NCCc1ccc(O)c(O)c1
: