Target
Alpha-2A adrenergic receptor
Ligand
BDBM78576
Substrate
Ki
200±n/a nM
Comments
PDSP_1851
Citation
 Richelson, ENelson, A Antagonism by neuroleptics of neurotransmitter receptors of normal human brain in vitro. Eur J Pharmacol 103:197-204 (1984)  
Target
Name:
Alpha-2A adrenergic receptor
Synonyms:
ADA2A_HUMAN ADRA2R Adrenergic alpha2A Alpha-2 adrenergic receptor subtype C10 Alpha-2A adrenoreceptor alpha-2A adrenergic receptor [Homo sapiens]
Type:
Enzyme
Mol. Mass.:
48979.91
Organism:
Homo sapiens (Human)
Description:
P08913
Residue:
450
  
Inhibitor
Name:
BDBM78576
Synonyms:
CIS-THIOTHIXENE SMR000058396 cid_941651 | med.21724, Compound Thiothixene
Type:
Small organic molecule
Emp. Form.:
C23H29N3O2S2
Mol. Mass.:
443.625
SMILES:
CN(C)S(=O)(=O)c1ccc2Sc3ccccc3\C(=C\CCN3CCN(C)CC3)c2c1
: