Target
Tyrosine-protein kinase ABL1
Ligand
BDBM50244526
Substrate
Meas. Tech.
In Vitro Kinase Assay
IC50
17±0.0 nM
Citation
 Zhou, TCommodore, LHuang, WSWang, YSawyer, TKShakespeare, WCClackson, TZhu, XDalgarno, DC Structural analysis of DFG-in and DFG-out dual Src-Abl inhibitors sharing a common vinyl purine template. Chem Biol Drug Des 75:18-28 (2010)  
Target
Name:
Tyrosine-protein kinase ABL1
Synonyms:
ABL ABL1_HUMAN JTK7 Proto-oncogene tyrosine-protein kinase ABL1 Tyrosine-protein kinase ABL V-abl Abelson murine leukemia viral oncogene homolog 1 p150 | tyrosine-protein kinase ABL1 isoform a
Type:
Enzyme
Mol. Mass.:
122897.30
Organism:
Homo sapiens (Human)
Description:
P00519
Residue:
1130
  
Inhibitor
Name:
BDBM50244526
Synonyms:
9-(2-(1H-indol-4-yl)vinyl)-N-(4-(dimethylphosphoryl)phenyl)-9H-purin-6-amine CHEMBL454868
Type:
Small organic molecule
Emp. Form.:
C23H21N6OP
Mol. Mass.:
428.4262
SMILES:
CP(C)(=O)c1ccc(Nc2ncnc3n(\C=C\c4cccc5[nH]ccc45)cnc23)cc1
: