Target
Tyrosine-protein kinase ABL1 [T315I]
Ligand
BDBM82130
Substrate
Meas. Tech.
In Vitro Kinase Assay
IC50
>5000±0.0 nM
Citation
 Zhou, TCommodore, LHuang, WSWang, YSawyer, TKShakespeare, WCClackson, TZhu, XDalgarno, DC Structural analysis of DFG-in and DFG-out dual Src-Abl inhibitors sharing a common vinyl purine template. Chem Biol Drug Des 75:18-28 (2010)  
Target
Name:
Tyrosine-protein kinase ABL1 [T315I]
Synonyms:
ABL ABL1 Abelson murine leukemia viral oncogene homolog 1 Proto-oncogene c-Abl Tyrosine-protein kinase ABL (T315I) c-ABL p150
Type:
Mol. Mass.:
122909.35
Organism:
Homo sapiens (Human)
Description:
P00519 (T315I)
Residue:
1130
  
Inhibitor
Name:
BDBM82130
Synonyms:
Dasatinib
Type:
Small organic molecule
Emp. Form.:
C22H28ClN7O2S
Mol. Mass.:
490.021
SMILES:
Cc1nc(cc(n1)N1CCN(CCO)CC1)N=C1NCC(S1)C(=O)Nc1c(C)cccc1Cl
: