Target
Isoform 1 of Fibronectin (1)
Ligand
BDBM50244526
Substrate
Meas. Tech.
In Vitro Kinase Assay
IC50
198±0.0 nM
Citation
 Zhou, TCommodore, LHuang, WSWang, YSawyer, TKShakespeare, WCClackson, TZhu, XDalgarno, DC Structural analysis of DFG-in and DFG-out dual Src-Abl inhibitors sharing a common vinyl purine template. Chem Biol Drug Des 75:18-28 (2010)  
Target
Name:
Isoform 1 of Fibronectin (1)
Synonyms:
FINC_HUMAN FN1 Fibronectin (1) | Tyrosine-protein kinase SRC
Type:
PROTEIN
Mol. Mass.:
262571.78
Organism:
Homo sapiens (Human)
Description:
EBI_17040
Residue:
2386
  
Inhibitor
Name:
BDBM50244526
Synonyms:
9-(2-(1H-indol-4-yl)vinyl)-N-(4-(dimethylphosphoryl)phenyl)-9H-purin-6-amine CHEMBL454868
Type:
Small organic molecule
Emp. Form.:
C23H21N6OP
Mol. Mass.:
428.4262
SMILES:
CP(C)(=O)c1ccc(Nc2ncnc3n(\C=C\c4cccc5[nH]ccc45)cnc23)cc1
: