Target
D(2) dopamine receptor
Ligand
BDBM81774
Substrate
Ki
20±n/a nM
Comments
PDSP_1785
Citation
 Zahniser, NRDubocovich, ML Comparison of dopamine receptor sites labeled by [3H]-S-sulpiride and [3H]-spiperone in striatum. J Pharmacol Exp Ther 227:592-9 (1983) Target
Name:
D(2) dopamine receptor
Synonyms:
DOPAMINE D2 | DRD2
Type:
Enzyme Catalytic Domain
Mol. Mass.:
50660.69
Organism:
RABBIT
Description:
DOPAMINE D2 DRD2 RABBIT::G1T1Q0
Residue:
443
  
Inhibitor
Name:
BDBM81774
Synonyms:
CAS_15676-16-1 Sulpiride-S | Sulpiride-l
Type:
Emp. Form.:
C15H23N3O4S
Mol. Mass.:
341.426
SMILES:
CCN1CCC[C@H]1CNC(=O)c1cc(ccc1OC)S(N)(=O)=O
: