Target
Gastrin/cholecystokinin type B receptor
Ligand
BDBM50084033
Substrate
Ki
0.4±n/a nM
Comments
PDSP_2198
Citation
 Ito, HSogabe, HNakarai, TSato, YTomoi, MKadowaki, MMatsuo, MTokoro, KYoshida, K Pharmacological profile of FK480, a novel cholecystokinin type-A receptor antagonist: comparison to loxiglumide. J Pharmacol Exp Ther 268:571-5 (1994) Target
Name:
Gastrin/cholecystokinin type B receptor
Synonyms:
Cckbr Cholecystokinin B receptor GASR_RAT | Gastrin/cholecystokinin type B receptor
Type:
Enzyme Catalytic Domain
Mol. Mass.:
48980.43
Organism:
RAT
Description:
Cholecystokinin A CCKBR RAT::P30553
Residue:
452
  
Inhibitor
Name:
BDBM50084033
Synonyms:
1H-Indole-2-carboxylic acid [(R)-1-(2-fluoro-phenyl)-4-oxo-3,4,6,7-tetrahydro-[1,4]diazepino[6,7,1-hi]indol-3-yl]-amide FK480
Type:
Small organic molecule
Emp. Form.:
C26H19FN4O2
Mol. Mass.:
438.4531
SMILES:
Fc1ccccc1C1=N[C@@H](NC(=O)c2cc3ccccc3[nH]2)C(=O)N2CCc3cccc1c23
: