Target
Somatostatin receptor type 3
Ligand
BDBM82253
Substrate
Ki
0.42±n/a nM
Comments
PDSP_382
Citation
 Rossowski, WJGu, ZFAkarca, USJensen, RTCoy, DH Characterization of somatostatin receptor subtypes controlling rat gastric acid and pancreatic amylase release. Peptides 15:1421-4 (1994)  
Target
Name:
Somatostatin receptor type 3
Synonyms:
SOMATOSTATIN SST3 Somatostatin receptor Somatostatin receptor type 3 | Sstr3
Type:
Enzyme Catalytic Domain
Mol. Mass.:
47161.54
Organism:
RAT
Description:
SOMATOSTATIN SST3 SSTR3 RAT::P30936
Residue:
428
  
Inhibitor
Name:
BDBM82253
Synonyms:
BIM 23052 | CAS_133073-82-2
Type:
Small organic molecule
Emp. Form.:
C61H75N11O10
Mol. Mass.:
1122.3159
SMILES:
C[C@@H](O)[C@H](NC(=O)[C@H](Cc1ccccc1)NC(=O)[C@@H](NC(=O)[C@H](CCCCN)NC(=O)[C@@H](Cc1c[nH]c2ccccc12)NC(=O)[C@H](Cc1ccccc1)NC(=O)[C@H](Cc1ccccc1)NC(=O)[C@H](N)Cc1ccccc1)[C@@H](C)O)C(N)=O
: