Target
Somatostatin receptor type 4
Ligand
BDBM82256
Substrate
Ki
43±n/a nM
Comments
PDSP_3341
Citation
 Rossowski, WJGu, ZFAkarca, USJensen, RTCoy, DH Characterization of somatostatin receptor subtypes controlling rat gastric acid and pancreatic amylase release. Peptides 15:1421-4 (1994)  
Target
Name:
Somatostatin receptor type 4
Synonyms:
SOMATOSTATIN SST4 Somatostatin receptor Sstr4
Type:
Enzyme Catalytic Domain
Mol. Mass.:
42096.84
Organism:
RAT
Description:
SOMATOSTATIN SST4 SSTR4 RAT::P30937
Residue:
384
  
Inhibitor
Name:
BDBM82256
Synonyms:
BIM 23056 D-Phe-Phe-Tyr-D-Trp-Lys-Val-Phe-D-Nal-NH2 | DC-25-20
Type:
Small organic molecule
Emp. Form.:
C71H81N11O9
Mol. Mass.:
1232.4711
SMILES:
CC(C)[C@H](NC(=O)[C@H](CCCCN)NC(=O)[C@@H](Cc1c[nH]c2ccccc12)NC(=O)[C@H](Cc1ccc(O)cc1)NC(=O)[C@H](Cc1ccccc1)NC(=O)[C@H](N)Cc1ccccc1)C(=O)N[C@@H](Cc1ccccc1)C(=O)N[C@H](Cc1ccc2ccccc2c1)C(N)=O
: