Target
Neuromedin-K receptor
Ligand
BDBM50071112
Substrate
Ki
368±n/a nM
Comments
PDSP_1755
Citation
 Oury-Donat, FCarayon, PThurneyssen, OPailhon, VEmonds-Alt, XSoubrié, PLe Fur, G Functional characterization of the nonpeptide neurokinin3 (NK3) receptor antagonist, SR142801 on the human NK3 receptor expressed in Chinese hamster ovary cells. J Pharmacol Exp Ther 274:148-54 (1995) Target
Name:
Neuromedin-K receptor
Synonyms:
NK-3 receptor NK3R NKR Neurokinin B receptor Neuromedin-3 receptor (NK-3R) Neuromedin-K receptor Neuromedin-K receptor (NK3) TAC3R Tachykinin receptor 3 | Tachykinin receptor 3 (NK3)
Type:
Enzyme
Mol. Mass.:
52221.96
Organism:
Homo sapiens (Human)
Description:
P29371
Residue:
465
  
Inhibitor
Name:
BDBM50071112
Synonyms:
CHEMBL56835 SR 48968
Type:
Small organic molecule
Emp. Form.:
C31H35Cl2N3O2
Mol. Mass.:
552.535
SMILES:
CN(CC(CCN1CCC(CC1)(NC(C)=O)c1ccccc1)c1ccc(Cl)c(Cl)c1)C(=O)c1ccccc1
: