Target
D(2) dopamine receptor
Ligand
BDBM82065
Substrate
Ki
19.8±n/a nM
Comments
PDSP_1418
Citation
 Kikuchi, TTottori, KUwahodo, YHirose, TMiwa, TOshiro, YMorita, S 7-(4-[4-(2,3-Dichlorophenyl)-1-piperazinyl]butyloxy)-3,4-dihydro-2(1H)-quinolinone (OPC-14597), a new putative antipsychotic drug with both presynaptic dopamine autoreceptor agonistic activity and postsynaptic D2 receptor antagonistic activity. J Pharmacol Exp Ther 274:329-36 (1995) Target
Name:
D(2) dopamine receptor
Synonyms:
DOPAMINE D2 DOPAMINE D2 Short Dopamine D2 receptor Drd2
Type:
G Protein-Coupled Receptor (GPCR)
Mol. Mass.:
50931.60
Organism:
Rattus norvegicus (rat)
Description:
P61169
Residue:
444
  
Inhibitor
Name:
BDBM82065
Synonyms:
CAS_163839 OPC-4392
Type:
Small organic molecule
Emp. Form.:
C24H29N3O2
Mol. Mass.:
391.506
SMILES:
Cc1cccc(N2CCN(CCCOc3ccc4ccc(=O)[nH]c4c3)CC2)c1C
: