Target
5-hydroxytryptamine receptor 7
Ligand
BDBM81789
Substrate
Ki
5.37±n/a nM
Comments
PDSP_736
Citation
 To, ZPBonhaus, DWEglen, RMJakeman, LB Characterization and distribution of putative 5-ht7 receptors in guinea-pig brain. Br J Pharmacol 115:107-16 (1995)  
Target
Name:
5-hydroxytryptamine receptor 7
Synonyms:
5-HT7 5HT7R_CAVPO Serotonin 7 (5-HT7) receptor
Type:
Enzyme Catalytic Domain
Mol. Mass.:
49632.36
Organism:
GUINEA PIG
Description:
5-HT7 HTR7 GUINEA PIG::P50407
Residue:
446
  
Inhibitor
Name:
BDBM81789
Synonyms:
5-CT,DP DP-5-CT NSC_156314
Type:
Small organic molecule
Emp. Form.:
C17H25N3O
Mol. Mass.:
287.3999
SMILES:
CCCN(CCC)CCc1c[nH]c2ccc(cc12)C(N)=O
: