Target
Nicotinic acetylcholine receptor
Ligand
BDBM50022772
Substrate
Ki
>10000±n/a nM
Comments
PDSP_648
Citation
 Houghtling, RADávila-García, MIKellar, KJ Characterization of (+/-)(-)[3H]epibatidine binding to nicotinic cholinergic receptors in rat and human brain. Mol Pharmacol 48:280-7 (1995) Target
Name:
Nicotinic acetylcholine receptor
Synonyms:
Nicotinic acetylcholine receptor | n-AChR
Type:
Enzyme Catalytic Domain
Mol. Mass.:
2478.99
Organism:
RAT
Description:
n-AChR 0 RAT::Q62594
Residue:
23
  
Inhibitor
Name:
BDBM50022772
Synonyms:
CHEMBL1025 Diisopropyl fluorophosphonate Diisopropyl phosphorofluoridate Diisopropylfluorophosphoric acid ester Fluorodiisopropyl phosphate Isofluorphate Isopropyl fluophosphate Neoglaucit bis(propan-2-yl) fluorophosphate | diisopropyl fluorophosphate
Type:
Small organic molecule
Emp. Form.:
C6H14FO3P
Mol. Mass.:
184.1457
SMILES:
CC(C)OP(F)(=O)OC(C)C
: