Target
5-hydroxytryptamine receptor 6
Ligand
BDBM78940
Substrate
Ki
0.39±n/a nM
Comments
PDSP_1219
Citation
 Monsma, FJShen, YWard, RPHamblin, MWSibley, DR Cloning and expression of a novel serotonin receptor with high affinity for tricyclic psychotropic drugs. Mol Pharmacol 43:320-7 (1993) Target
Name:
5-hydroxytryptamine receptor 6
Synonyms:
5-HT-6 5-hydroxytryptamine receptor 6 Htr6 Serotonin (5-HT) receptor Serotonin receptor 6
Type:
Enzyme Catalytic Domain
Mol. Mass.:
46945.51
Organism:
RAT
Description:
5-HT6 HTR6 RAT::P31388
Residue:
436
  
Inhibitor
Name:
BDBM78940
Synonyms:
METHIOTHEPIN Methiothepin mesylate salt cid_3039995 methanesulfonic acid;1-methyl-4-(3-methylsulfanyl-5,6-dihydrobenzo[b][1]benzothiepin-5-yl)piperazine | methanesulfonic acid;1-methyl-4-[3-(methylthio)-5,6-dihydrobenzo[b][1]benzothiepin-5-yl]piperazine
Type:
Small organic molecule
Emp. Form.:
C20H24N2S2
Mol. Mass.:
356.548
SMILES:
CSc1ccc2Sc3ccccc3CC(N3CCN(C)CC3)c2c1
: