Target
5-hydroxytryptamine receptor 5A
Ligand
BDBM50000492
Substrate
Ki
1000±n/a nM
Comments
PDSP_1990
Citation
 Erlander, MGLovenberg, TWBaron, BMde Lecea, LDanielson, PERacke, MSlone, ALSiegel, BWFoye, PECannon, K Two members of a distinct subfamily of 5-hydroxytryptamine receptors differentially expressed in rat brain. Proc Natl Acad Sci U S A 90:3452-6 (1993)  
Target
Name:
5-hydroxytryptamine receptor 5A
Synonyms:
5-HT-5A 5-hydroxytryptamine receptor 5A 5ht5a REC17 Serotonin receptor 5A
Type:
Enzyme Catalytic Domain
Mol. Mass.:
40684.21
Organism:
RAT
Description:
5-HT5a HTR5A RAT::P35364
Residue:
357
  
Inhibitor
Name:
BDBM50000492
Synonyms:
(zacopride)4-Amino-N-(1-aza-bicyclo[2.2.2]oct-3-yl)-5-chloro-2-methoxy-benzamide 4-Amino-N-(1-aza-bicyclo[2.2.2]oct-3-yl)-5-chloro-2-methoxy-benzamide (Zacopride) CHEMBL18041 ZACOPRIDE ZACOPRIDE,RS | ZACOPRIDE,S
Type:
Small organic molecule
Emp. Form.:
C15H20ClN3O2
Mol. Mass.:
309.791
SMILES:
COc1cc(N)c(Cl)cc1C(=O)NC1CN2CCC1CC2
: