Target
Muscarinic acetylcholine receptor M3
Ligand
BDBM50151858
Substrate
Ki
0.63±n/a nM
Comments
PDSP_3904
Citation
 Lazareno, SBuckley, NJRoberts, FF Characterization of muscarinic M4 binding sites in rabbit lung, chicken heart, and NG108-15 cells. Mol Pharmacol 38:805-15 (1990) Target
Name:
Muscarinic acetylcholine receptor M3
Synonyms:
ACM3_RAT Chrm-3 | Chrm3
Type:
Enzyme Catalytic Domain
Mol. Mass.:
66086.66
Organism:
RAT
Description:
Cholinergic, muscarinic M3 CHRM3 RAT::P08483
Residue:
589
  
Inhibitor
Name:
BDBM50151858
Synonyms:
4-(diethylamino)but-2-yn-1-yl (2S)-cyclohexyl(hydroxy)phenylacetate OXYBUTYNIN | esoxybutynin
Type:
Small organic molecule
Emp. Form.:
C22H31NO3
Mol. Mass.:
357.4864
SMILES:
CCN(CC)CC#CCOC(=O)[C@@](O)(C1CCCCC1)c1ccccc1
: