Target
Muscarinic acetylcholine receptor M4
Ligand
BDBM82372
Substrate
Ki
0.21±n/a nM
Comments
PDSP_983
Citation
 Lazareno, SBuckley, NJRoberts, FF Characterization of muscarinic M4 binding sites in rabbit lung, chicken heart, and NG108-15 cells. Mol Pharmacol 38:805-15 (1990) Target
Name:
Muscarinic acetylcholine receptor M4
Synonyms:
ACM4_CHICK Cholinergic, muscarinic M4
Type:
Enzyme Catalytic Domain
Mol. Mass.:
54968.10
Organism:
Chick
Description:
Cholinergic, muscarinic M4 CHRM4 Chick::P17200
Residue:
490
  
Inhibitor
Name:
BDBM82372
Synonyms:
CAS_22254-24-6 NSC_3746
Type:
Small organic molecule
Emp. Form.:
C20H30NO3
Mol. Mass.:
332.4566
SMILES:
CC(C)[N+]1(C)C2CCC1CC(C2)OC(=O)C(CO)c1ccccc1
: