Target
Muscarinic acetylcholine receptor M4
Ligand
BDBM50015720
Substrate
Ki
0.93±n/a nM
Comments
PDSP_1688
Citation
 Lazareno, SBuckley, NJRoberts, FF Characterization of muscarinic M4 binding sites in rabbit lung, chicken heart, and NG108-15 cells. Mol Pharmacol 38:805-15 (1990) Target
Name:
Muscarinic acetylcholine receptor M4
Synonyms:
ACM4_CHICK Cholinergic, muscarinic M4
Type:
Enzyme Catalytic Domain
Mol. Mass.:
54968.10
Organism:
Chick
Description:
Cholinergic, muscarinic M4 CHRM4 Chick::P17200
Residue:
490
  
Inhibitor
Name:
BDBM50015720
Synonyms:
(hyoscine)3-Hydroxy-2-phenyl-propionic acid 9-methyl-3-oxa-9-aza-tricyclo[3.3.1.0*2,4*]non-7-yl ester 9-methyl-3-oxa-9-azatricyclo[3.3.1.02,4]non-7-yl 3-hydroxy-2-phenylpropanoate CHEMBL13030 SCOPOLAMINE
Type:
Small organic molecule
Emp. Form.:
C17H21NO4
Mol. Mass.:
303.3529
SMILES:
CN1C2CC(CC1C1OC21)OC(=O)C(CO)c1ccccc1
: