Target
Muscarinic acetylcholine receptor M4
Ligand
BDBM81800
Substrate
Ki
0.52±n/a nM
Comments
PDSP_1700
Citation
 Lazareno, SBuckley, NJRoberts, FF Characterization of muscarinic M4 binding sites in rabbit lung, chicken heart, and NG108-15 cells. Mol Pharmacol 38:805-15 (1990) Target
Name:
Muscarinic acetylcholine receptor M4
Synonyms:
CHRM4 Cholinergic, muscarinic M4
Type:
Enzyme Catalytic Domain
Mol. Mass.:
30028.84
Organism:
bovine
Description:
A6QQE4
Residue:
271
  
Inhibitor
Name:
BDBM81800
Synonyms:
CAS_57558-44-8 Secoverine
Type:
Small organic molecule
Emp. Form.:
C22H35NO2
Mol. Mass.:
345.5188
SMILES:
CCN(CCCC(=O)C1CCCCC1)C(C)Cc1ccc(OC)cc1
: