Target
Gastrin/cholecystokinin type B receptor
Ligand
BDBM50005463
Substrate
Ki
0.46±n/a nM
Comments
PDSP_2205
Citation
 Pendley, CEFitzpatrick, LRCapolino, AJDavis, MAEsterline, NJJakubowska, ABertrand, PGuyon, CDubroeucq, MCMartin, GE RP 73870, a gastrin/cholecystokinin-B receptor antagonist with potent anti-ulcer activity in the rat. J Pharmacol Exp Ther 273:1015-22 (1995) Target
Name:
Gastrin/cholecystokinin type B receptor
Synonyms:
CCKBR | Cholecystokinin A
Type:
Enzyme Catalytic Domain
Mol. Mass.:
48683.10
Organism:
GUINEA PIG
Description:
Cholecystokinin A CCKBR GUINEA PIG::H0VZC5
Residue:
450
  
Inhibitor
Name:
BDBM50005463
Synonyms:
(R)-1H-Indole-2-carboxylic acid (1-methyl-2-oxo-5-phenyl-2,3-dihydro-1H-benzo[e][1,4]diazepin-3-yl)-amide: 0.1C4H10O (S)-N-(1-methyl-2-oxo-5-phenyl-2,3-dihydro-1H-benzo[e][1,4]diazepin-3-yl)-1H-indole-2-carboxamide 1H-Indole-2-carboxylic acid ((S)-1-methyl-2-oxo-5-phenyl-2,3-dihydro-1H-benzo[e][1,4]diazepin-3-yl)-amide 1H-Indole-2-carboxylic acid (1-methyl-2-oxo-5-phenyl-2,3-dihydro-1H-benzo[e][1,4]diazepin-3-yl)-amide (L-364,718 ((S)-devazepide) 1H-Indole-2-carboxylic acid (1-methyl-2-oxo-5-phenyl-2,3-dihydro-1H-benzo[e][1,4]diazepin-3-yl)-amide(Devazepide or (R) L364718) 1H-Indole-2-carboxylic acid (1-methyl-2-oxo-5-phenyl-2,3-dihydro-1H-benzo[e][1,4]diazepin-3-yl)-amide(devazepide) CCK antagonist synthetic 17 CHEMBL9506 L-364,718 MK-329
Type:
Small organic molecule
Emp. Form.:
C25H20N4O2
Mol. Mass.:
408.4519
SMILES:
CN1c2ccccc2C(=N[C@H](NC(=O)c2cc3ccccc3[nH]2)C1=O)c1ccccc1
: