Target
Cholecystokinin
Ligand
BDBM82404
Substrate
Ki
0.48±n/a nM
Comments
PDSP_2242
Citation
 Pendley, CEFitzpatrick, LRCapolino, AJDavis, MAEsterline, NJJakubowska, ABertrand, PGuyon, CDubroeucq, MCMartin, GE RP 73870, a gastrin/cholecystokinin-B receptor antagonist with potent anti-ulcer activity in the rat. J Pharmacol Exp Ther 273:1015-22 (1995) Target
Name:
Cholecystokinin
Synonyms:
CCK Cholecystokinin B
Type:
Enzyme Catalytic Domain
Mol. Mass.:
12528.64
Organism:
GUINEA PIG
Description:
Cholecystokinin B 0 GUINEA PIG::P01356
Residue:
114
  
Inhibitor
Name:
BDBM82404
Synonyms:
Glycinamide,N-[[[3-(2-sulfoethyl)phenyl]amino]carbonyl]glycyl-N2-(3-methoxyphenyl)-N-methyl-N-phenyl-(9CI) | RP 73870
Type:
Emp. Form.:
C26H27N3O7S
Mol. Mass.:
525.573
SMILES:
COc1cccc(c1)N(C(=O)CNC(=O)c1cccc(CCS(O)(=O)=O)c1)C(=O)N(C)c1ccccc1
: