Target
Neuropeptide Y receptor type 2
Ligand
BDBM82420
Substrate
Ki
2.88±n/a nM
Comments
PDSP_3127
Citation
 Gerald, CAdham, NKao, HTOlsen, MALaz, TMSchechter, LEBard, JAVaysse, PJHartig, PRBranchek, TA The 5-HT4 receptor: molecular cloning and pharmacological characterization of two splice variants. EMBO J 14:2806-15 (1995) Target
Name:
Neuropeptide Y receptor type 2
Synonyms:
NPY-Y2 NPY2-R NPY2R_HUMAN Y2 receptor | neuropeptide Y receptor Y2
Type:
Enzyme Catalytic Domain
Mol. Mass.:
42734.65
Organism:
Homo sapiens (Human)
Description:
NPY-Y2 NPY2R HUMAN::P49146
Residue:
381
  
Inhibitor
Name:
BDBM82420
Synonyms:
NPY, C2 PYY 3-36, porcine
Type:
Small organic molecule
Emp. Form.:
C96H160N32O23S2
Mol. Mass.:
2194.628
SMILES:
CC[C@H](C)[C@H](NC(=O)[C@@H](CS)NC(=O)[C@H](Cc1cnc[nH]1)NC(=O)[C@H](CCCN=C(N)N)NC(=O)CCCCCCCNC(=O)[C@@H](CCCCN)NC(=O)[C@@H](CO)NC(=O)[C@@H](CS)NC(=O)[C@H](N)Cc1ccc(O)cc1)C(=O)N[C@@H](CC(N)=O)C(=O)N[C@@H](CC(C)C)C(=O)N[C@@H]([C@H](C)CC)C(=O)N[C@@H]([C@@H](C)O)C(=O)N[C@@H](CCCN=C(N)N)C(=O)N[C@@H](CCC(N)=O)C(=O)N[C@@H](CCCN=C(N)N)C(=O)N[C@@H](Cc1ccc(O)cc1)C(N)=O
: