Target
Alpha-1B adrenergic receptor
Ligand
BDBM50033111
Substrate
Ki
3.16±n/a nM
Comments
PDSP_1798
Citation
 Schwinn, DAJohnston, GIPage, SOMosley, MJWilson, KHWorman, NPCampbell, SFidock, MDFurness, LMParry-Smith, DJ Cloning and pharmacological characterization of human alpha-1 adrenergic receptors: sequence corrections and direct comparison with other species homologues. J Pharmacol Exp Ther 272:134-42 (1995) Target
Name:
Alpha-1B adrenergic receptor
Synonyms:
ADA1B_MESAU adrenergic Alpha1
Type:
Enzyme Catalytic Domain
Mol. Mass.:
56514.13
Organism:
HAMSTER
Description:
adrenergic Alpha1 0 HAMSTER::P18841
Residue:
515
  
Inhibitor
Name:
BDBM50033111
Synonyms:
1-(4-Amino-6,7-dimethoxy-2-quinazolinyl)-4-((tetrahydro-2-furanyl)carbonyl)piperazine CHEMBL611 Terazosine
Type:
Small organic molecule
Emp. Form.:
C19H25N5O4
Mol. Mass.:
387.4329
SMILES:
COc1cc2nc(nc(N)c2cc1OC)N1CCN(CC1)C(=O)C1CCCO1
: